[GenABEL-dev] updated GenABEL_1.6-5 on CRAN

Kurt Hornik Kurt.Hornik at wu.ac.at
Fri Jan 28 13:08:49 CET 2011


>>>>> Yurii Aulchenko writes:

> Dear Kurt,
> I have uploaded updated GenABEL_1.6-5 on CRAN ftp. Hope it will pass
> all checks well!

Thanks.  Actually, I get

g++-4.4 -I/home/Hornik/tmp/R/include  -I/usr/local/include   -DCOMPILE_WITH_R -fpic  -g -O2 -Wall -pedantic -c iterator.cpp -o iterator.o
iterator.cpp: In function ‘SEXPREC* iteratorGA(SEXPREC*, SEXPREC*, SEXPREC*, SEXPREC*, SEXPREC*, SEXPREC*, SEXPREC*, SEXPREC*, ...)’:
iterator.cpp:249: error: ‘va_start’ was not declared in this scope
iterator.cpp:251: error: expected primary-expression before ‘)’ token
iterator.cpp:251: error: ‘va_arg’ was not declared in this scope
iterator.cpp:253: error: ‘va_end’ was not declared in this scope
make: *** [iterator.o] Error 1

Can u pls fix?

Best
-k

> with best wishes,
> Yurii




More information about the genabel-devel mailing list